Reaction Details
TargetcAMP-specific 3',5'-cyclic phosphodiesterase 4B
LigandBDBM50017319
Substrate/Competitorn/a
Meas. Tech.ChEMBL_1362418 (CHEMBL3292526)
IC50 0.050119±n/a nM
Citation De Savi, CCox, RJWarner, DJCook, ARDickinson, MRMcDonough, AMorrill, LCParker, BAndrews, GYoung, SSGilmour, PSRiley, RDearman, MS Efficacious inhaled PDE4 inhibitors with low emetic potential and long duration of action for the treatment of COPD. J Med Chem57:4661-76 (2014) 
 
cAMP-specific 3',5'-cyclic phosphodiesterase 4B
Name:cAMP-specific 3',5'-cyclic phosphodiesterase 4B
Type:Protein
Mol. Mass.:83318.87
Organism:Homo sapiens (Human)
Description:Q07343
Residue:736
BDBM50017319
NameBDBM50017319
Synonyms:CHEMBL3288005
TypeSmall organic molecule
Emp. Form.C38H40FN7O5
Mol. Mass.693.7665
SMILESCc1cc(C)n2ncc(C(=O)N[C@H]3CC[C@H](CC3)NC(=O)c3cc(F)cnc3Oc3cccc(c3)-c3ccc(O)cc3CN3CCOCC3)c2n1