Reaction Details
TargetIntegrase
LigandBDBM50017351
Substrate/Competitorn/a
Meas. Tech.ChEMBL_1363202 (CHEMBL3294150)
IC50 70±n/a nM
Citation Suchaud, VBailly, FLion, CCalmels, CAndréola, MLChrist, FDebyser, ZCotelle, P Investigation of a novel series of 2-hydroxyisoquinoline-1,3(2H,4H)-diones as human immunodeficiency virus type 1 integrase inhibitors. J Med Chem57:4640-60 (2014) 
 
Integrase
Name:Integrase
Synonyms:Human immunodeficiency virus type 1 integrase
Type:PROTEIN
Mol. Mass.:32231.48
Organism:Human immunodeficiency virus 1
Description:ChEMBL_90865
Residue:288
BDBM50017351
NameBDBM50017351
Synonyms:CHEMBL3288282
TypeSmall organic molecule
Emp. Form.C18H12FN3O4
Mol. Mass.353.304
SMILESOc1c(C(=O)NCc2ccc(F)cc2)c2ccc(cc2c(=O)n1O)C#N