Reaction Details
TargetIntegrase
LigandBDBM50017356
Substrate/Competitorn/a
Meas. Tech.ChEMBL_1363202 (CHEMBL3294150)
IC50 60±n/a nM
Citation Suchaud, VBailly, FLion, CCalmels, CAndréola, MLChrist, FDebyser, ZCotelle, P Investigation of a novel series of 2-hydroxyisoquinoline-1,3(2H,4H)-diones as human immunodeficiency virus type 1 integrase inhibitors. J Med Chem57:4640-60 (2014) 
 
Integrase
Name:Integrase
Synonyms:Human immunodeficiency virus type 1 integrase
Type:PROTEIN
Mol. Mass.:32231.48
Organism:Human immunodeficiency virus 1
Description:ChEMBL_90865
Residue:288
BDBM50017356
NameBDBM50017356
Synonyms:CHEMBL3288263
TypeSmall organic molecule
Emp. Form.C23H18FN3O5S
Mol. Mass.467.47
SMILESON1C(=O)C(C(=O)NCc2ccc(F)cc2)c2ccc(NC(=O)Cc3cccs3)cc2C1=O