Reaction Details
TargetCytochrome P450 2D6
LigandBDBM50410855
Substrate/Competitorn/a
Meas. Tech.ChEMBL_1363224 (CHEMBL3294172)
IC50 17±n/a nM
Citation Suchaud, VBailly, FLion, CCalmels, CAndréola, MLChrist, FDebyser, ZCotelle, P Investigation of a novel series of 2-hydroxyisoquinoline-1,3(2H,4H)-diones as human immunodeficiency virus type 1 integrase inhibitors. J Med Chem57:4640-60 (2014) 
 
Cytochrome P450 2D6
Name:Cytochrome P450 2D6
Type:Protein
Mol. Mass.:55774.82
Organism:Homo sapiens (Human)
Description:P10635
Residue:497
BDBM50410855
NameBDBM50410855
Synonyms:CIN-QUIN QUINIDINE SULFATE
TypeSmall organic molecule
Emp. Form.C20H24N2O2
Mol. Mass.324.4168
SMILESCOc1ccc2nccc([C@H](O)[C@H]3CC4CCN3C[C@@H]4C=C)c2c1