Reaction Details
TargetProstaglandin E synthase
LigandBDBM50017961
Substrate/Competitorn/a
Meas. Tech.ChEMBL_1365207 (CHEMBL3292957)
IC50 4160±n/a nM
Citation Lauro, GStrocchia, MTerracciano, SBruno, IFischer, KPergola, CWerz, ORiccio, RBifulco, G Exploration of the dihydropyrimidine scaffold for the development of new potential anti-inflammatory agents blocking prostaglandin E2 synthase-1 enzyme (mPGES-1). Eur J Med Chem80:407-15 (2014) 
 
Prostaglandin E synthase
Name:Prostaglandin E synthase
Type:Protein
Mol. Mass.:17112.22
Organism:Homo sapiens (Human)
Description:n/a
Residue:152
BDBM50017961
NameBDBM50017961
Synonyms:CHEMBL3289346
TypeSmall organic molecule
Emp. Form.C26H21F3N2O6
Mol. Mass.514.4499
SMILESCCOC(=O)C1=C([C@@H](NC(=O)N1)c1ccc(o1)-c1cccc(c1)C(F)(F)F)C(=O)c1ccc(OC)cc1