Reaction Details
TargetDihydroorotate dehydrogenase (quinone), mitochondrial
LigandBDBM50018011
Substrate/Competitorn/a
Meas. Tech.ChEMBL_1366444 (CHEMBL3296344)
IC50 150±n/a nM
Citation Deng, XKokkonda, SEl Mazouni, FWhite, JBurrows, JNKaminsky, WCharman, SAMatthews, DRathod, PKPhillips, MA Fluorine modulates species selectivity in the triazolopyrimidine class of Plasmodium falciparum dihydroorotate dehydrogenase inhibitors. J Med Chem57:5381-94 (2014) 
 
Dihydroorotate dehydrogenase (quinone), mitochondrial
Name:Dihydroorotate dehydrogenase (quinone), mitochondrial
Type:PROTEIN
Mol. Mass.:42711.08
Organism:Mus musculus
Description:ChEMBL_1366444
Residue:395
BDBM50018011
NameBDBM50018011
Synonyms:Aubagio HMR-1726 | TERIFLUNOMIDE
TypeSmall organic molecule
Emp. Form.C12H9F3N2O2
Mol. Mass.270.2073
SMILESC\C(O)=C(/C#N)C(=O)Nc1ccc(cc1)C(F)(F)F