Reaction Details
Target5-hydroxytryptamine receptor 2A
LigandBDBM50018249
Substrate/Competitorn/a
Meas. Tech.ChEMBL_1366808 (CHEMBL3297243)
Ki 2.3±n/a nM
Citation Kolaczkowski, MMarcinkowska, MBucki, APawlowski, MMitka, KJaskowska, JKowalski, PKazek, GSiwek, AWasik, AWesolowska, AMierzejewski, PBienkowski, P Novel arylsulfonamide derivatives with 5-HT6/5-HT7 receptor antagonism targeting behavioral and psychological symptoms of dementia. J Med Chem57:4543-57 (2014) 
 
5-hydroxytryptamine receptor 2A
Name:5-hydroxytryptamine receptor 2A
Type:undefined
Mol. Mass.:52607.65
Organism:Homo sapiens (Human)
Description:P28223
Residue:471
BDBM50018249
NameBDBM50018249
Synonyms:CHEMBL3290015
TypeSmall organic molecule
Emp. Form.C24H25F2N3O3S2
Mol. Mass.505.6
SMILESCc1c(sc2ccc(F)cc12)S(=O)(=O)NCCCN1CCC(CC1)c1noc2cc(F)ccc12