Reaction Details
TargetD(2) dopamine receptor
LigandBDBM50018033
Substrate/Competitorn/a
Meas. Tech.ChEMBL_1366809 (CHEMBL3297244)
Ki 0.900000±n/a nM
Citation Kolaczkowski, MMarcinkowska, MBucki, APawlowski, MMitka, KJaskowska, JKowalski, PKazek, GSiwek, AWasik, AWesolowska, AMierzejewski, PBienkowski, P Novel arylsulfonamide derivatives with 5-HT6/5-HT7 receptor antagonism targeting behavioral and psychological symptoms of dementia. J Med Chem57:4543-57 (2014) 
 
D(2) dopamine receptor
Name:D(2) dopamine receptor
Type:Cell-surface receptors
Mol. Mass.:50647.10
Organism:Homo sapiens (Human)
Description:P14416
Residue:443
BDBM50018033
NameBDBM50018033
Synonyms:CHEMBL3289954
TypeSmall organic molecule
Emp. Form.C25H28N4O2S2
Mol. Mass.480.645
SMILESO=S(=O)(NCCCCN1CCN(CC1)c1nsc2ccccc12)c1ccc2ccccc2c1