Reaction Details
Target5-hydroxytryptamine receptor 2A
LigandBDBM50018192
Substrate/Competitorn/a
Meas. Tech.ChEMBL_1366808 (CHEMBL3297243)
Ki 7.7±n/a nM
Citation Kolaczkowski, MMarcinkowska, MBucki, APawlowski, MMitka, KJaskowska, JKowalski, PKazek, GSiwek, AWasik, AWesolowska, AMierzejewski, PBienkowski, P Novel arylsulfonamide derivatives with 5-HT6/5-HT7 receptor antagonism targeting behavioral and psychological symptoms of dementia. J Med Chem57:4543-57 (2014) 
 
5-hydroxytryptamine receptor 2A
Name:5-hydroxytryptamine receptor 2A
Type:undefined
Mol. Mass.:52607.65
Organism:Homo sapiens (Human)
Description:P28223
Residue:471
BDBM50018192
NameBDBM50018192
Synonyms:CHEMBL3289980
TypeSmall organic molecule
Emp. Form.C25H27ClN4O3S
Mol. Mass.499.025
SMILESClc1ccc2cc(ccc2c1)S(=O)(=O)NCCCCN1CCN(CC1)c1noc2ccccc12