Reaction Details
TargetEstrogen receptor
LigandBDBM50121317
Substrate/Competitorn/a
Meas. Tech.ChEMBL_1361046 (CHEMBL3295678)
EC50 0.015±n/a nM
Citation Maximov, PYFernandes, DJMcDaniel, REMyers, CBCurpan, RFJordan, VC Influence of the length and positioning of the antiestrogenic side chain of endoxifen and 4-hydroxytamoxifen on gene activation and growth of estrogen receptor positive cancer cells. J Med Chem57:4569-83 (2014) 
 
Estrogen receptor
Name:Estrogen receptor
Type:Protein
Mol. Mass.:66230.44
Organism:Homo sapiens (Human)
Description:P03372
Residue:595
BDBM50121317
NameBDBM50121317
Synonyms:1,1-bis(4,4'-hydroxyphenyl)-2-phenylbut-1-ene 4-[1-(4-hydroxyphenyl)-2-phenylbut-1-enyl]phenol | CHEMBL149791
TypeSmall organic molecule
Emp. Form.C22H20O2
Mol. Mass.316.393
SMILES[#6]-[#6]\[#6](=[#6](\c1ccc(-[#8])cc1)-c1ccc(-[#8])cc1)-c1ccccc1