Reaction Details
TargetSphingosine-1-phosphate lyase 1
LigandBDBM50158336
Substrate/Competitorn/a
Meas. Tech.ChEMBL_1361382 (CHEMBL3293781)
IC50 17000±n/a nM
Citation Weiler, SBraendlin, NBeerli, CBergsdorf, CSchubart, ASrinivas, HOberhauser, BBillich, A Orally active 7-substituted (4-benzylphthalazin-1-yl)-2-methylpiperazin-1-yl]nicotinonitriles as active-site inhibitors of sphingosine 1-phosphate lyase for the treatment of multiple sclerosis. J Med Chem57:5074-84 (2014) 
 
Sphingosine-1-phosphate lyase 1
Name:Sphingosine-1-phosphate lyase 1
Type:PROTEIN
Mol. Mass.:63546.76
Organism:Homo sapiens (Human)
Description:ChEMBL_108363
Residue:568
BDBM50158336
NameBDBM50158336
Synonyms:2-(4-octylphenethyl)-2-aminopropane-1,3-diol 2-amino-2-(4-octylphenethyl)propane-1,3-diol CHEMBL314854 FINGOLIMOD HYDROCHLORIDE
TypeSmall organic molecule
Emp. Form.C19H33NO2
Mol. Mass.307.4708
SMILESCCCCCCCCc1ccc(CCC(N)(CO)CO)cc1