Reaction Details
TargetBeta-2 adrenergic receptor
LigandBDBM50018591
Substrate/Competitorn/a
Meas. Tech.ChEMBL_1362117 (CHEMBL3294889)
EC50 1585±n/a nM
Citation Jacobsen, JRAggen, JBChurch, TJKlein, UPfeiffer, JWPulido-Rios, TMThomas, GRYu, CMoran, EJ Multivalent design of long-actingß(2)-adrenoceptor agonists incorporating biarylamines. Bioorg Med Chem Lett24:2625-30 (2014) 
 
Beta-2 adrenergic receptor
Name:Beta-2 adrenergic receptor
Type:n/a
Mol. Mass.:46461.69
Organism:Homo sapiens (Human)
Description:P07550
Residue:413
BDBM50018591
NameBDBM50018591
Synonyms:CHEMBL3290972
TypeSmall organic molecule
Emp. Form.C24H26Cl2N2O3
Mol. Mass.461.381
SMILESOCc1cc(ccc1O)C(O)CNCCc1ccc(NCc2ccc(Cl)c(Cl)c2)cc1