Reaction Details
TargetBeta-2 adrenergic receptor
LigandBDBM50018603
Substrate/Competitorn/a
Meas. Tech.ChEMBL_1362118 (CHEMBL3294890)
Ki 1259±n/a nM
Citation Jacobsen, JRAggen, JBChurch, TJKlein, UPfeiffer, JWPulido-Rios, TMThomas, GRYu, CMoran, EJ Multivalent design of long-actingß(2)-adrenoceptor agonists incorporating biarylamines. Bioorg Med Chem Lett24:2625-30 (2014) 
 
Beta-2 adrenergic receptor
Name:Beta-2 adrenergic receptor
Type:n/a
Mol. Mass.:46461.69
Organism:Homo sapiens (Human)
Description:P07550
Residue:413
BDBM50018603
NameBDBM50018603
Synonyms:CHEMBL3290984
TypeSmall organic molecule
Emp. Form.C24H28N2O4
Mol. Mass.408.4901
SMILESCOc1ccc(Nc2ccc(CCNCC(O)c3ccc(O)c(CO)c3)cc2)cc1