Reaction Details
TargetBeta-2 adrenergic receptor
LigandBDBM50018607
Substrate/Competitorn/a
Meas. Tech.ChEMBL_1362118 (CHEMBL3294890)
Ki 316±n/a nM
Citation Jacobsen, JRAggen, JBChurch, TJKlein, UPfeiffer, JWPulido-Rios, TMThomas, GRYu, CMoran, EJ Multivalent design of long-actingß(2)-adrenoceptor agonists incorporating biarylamines. Bioorg Med Chem Lett24:2625-30 (2014) 
 
Beta-2 adrenergic receptor
Name:Beta-2 adrenergic receptor
Type:n/a
Mol. Mass.:46461.69
Organism:Homo sapiens (Human)
Description:P07550
Residue:413
BDBM50018607
NameBDBM50018607
Synonyms:CHEMBL3290988
TypeSmall organic molecule
Emp. Form.C29H30N2O3
Mol. Mass.454.5601
SMILESOCc1cc(ccc1O)C(O)CNCCc1ccc(Nc2cccc(c2)-c2ccccc2)cc1