Reaction Details
TargetBeta-2 adrenergic receptor
LigandBDBM50018561
Substrate/Competitorn/a
Meas. Tech.ChEMBL_1362118 (CHEMBL3294890)
Ki 1259±n/a nM
Citation Jacobsen, JRAggen, JBChurch, TJKlein, UPfeiffer, JWPulido-Rios, TMThomas, GRYu, CMoran, EJ Multivalent design of long-actingß(2)-adrenoceptor agonists incorporating biarylamines. Bioorg Med Chem Lett24:2625-30 (2014) 
 
Beta-2 adrenergic receptor
Name:Beta-2 adrenergic receptor
Type:n/a
Mol. Mass.:46461.69
Organism:Homo sapiens (Human)
Description:P07550
Residue:413
BDBM50018561
NameBDBM50018561
Synonyms:CHEMBL3290995
TypeSmall organic molecule
Emp. Form.C23H25FN2O3
Mol. Mass.396.4546
SMILESOCc1cc(ccc1O)C(O)CNCCc1ccc(Nc2ccc(F)cc2)cc1