Reaction Details
TargetBeta-1 adrenergic receptor
LigandBDBM50018597
Substrate/Competitorn/a
Meas. Tech.ChEMBL_1362119 (CHEMBL3294891)
Ki<10000±n/a nM
Citation Jacobsen, JRAggen, JBChurch, TJKlein, UPfeiffer, JWPulido-Rios, TMThomas, GRYu, CMoran, EJ Multivalent design of long-actingß(2)-adrenoceptor agonists incorporating biarylamines. Bioorg Med Chem Lett24:2625-30 (2014) 
 
Beta-1 adrenergic receptor
Name:Beta-1 adrenergic receptor
Type:G Protein-Coupled Receptor (GPCR)
Mol. Mass.:51338.40
Organism:Homo sapiens (Human)
Description:P08588
Residue:477
BDBM50018597
NameBDBM50018597
Synonyms:CHEMBL3290978
TypeSmall organic molecule
Emp. Form.C27H33N3O3
Mol. Mass.447.5692
SMILESOCc1cc(ccc1O)C(O)CNCCc1ccc(cc1)N1CCN(CC1)c1ccccc1