Reaction Details
TargetBeta-secretase 1
LigandBDBM50241052
Substrate/Competitorn/a
Meas. Tech.ChEMBL_1365275 (CHEMBL3293240)
Ki 5130±n/a nM
Citation Park, SHYang, EJKim, SISong, KS ß-Secretase (BACE1)-inhibiting C-methylrotenoids from Abronia nana suspension cultures. Bioorg Med Chem Lett24:2945-8 (2014) 
 
Beta-secretase 1
Name:Beta-secretase 1
Type:Protein
Mol. Mass.:55755.10
Organism:Homo sapiens (Human)
Description:P56817
Residue:501
BDBM50241052
NameBDBM50241052
Synonyms:1,2,3,4,6-Pgg 1,2,3,4,6-pentakis-O-galloyl-beta-D-glucose acs.jmedchem.1c00409_ST.650 | beta-D-glucopyranose pentakis(3,4,5-trihydroxybenzoate)
TypeSmall organic molecule
Emp. Form.C41H32O26
Mol. Mass.940.6772
SMILESOc1cc(cc(O)c1O)C(=O)OC[C@H]1O[C@@H](OC(=O)c2cc(O)c(O)c(O)c2)[C@H](OC(=O)c2cc(O)c(O)c(O)c2)[C@@H](OC(=O)c2cc(O)c(O)c(O)c2)[C@@H]1OC(=O)c1cc(O)c(O)c(O)c1