Reaction Details
TargetDelta-type opioid receptor
LigandBDBM50018999
Substrate/Competitorn/a
Meas. Tech.ChEMBL_1365290 (CHEMBL3292384)
Ki 32±n/a nM
Citation Nagase, HNakajima, RYamamoto, NHirayama, SIwai, TNemoto, TGouda, HHirono, SFujii, H Design and synthesis of quinolinopropellane derivatives with selectived opioid receptor agonism. Bioorg Med Chem Lett24:2851-4 (2014) 
 
Delta-type opioid receptor
Name:Delta-type opioid receptor
Type:G Protein-Coupled Receptor (GPCR)
Mol. Mass.:40382.98
Organism:Homo sapiens (Human)
Description:Competition binding assays were carried out using membrane preparations from transfected HN9.10 cells that constitutively expressed the delta opioid receptor.
Residue:372
BDBM50018999
NameBDBM50018999
Synonyms:CHEMBL3287469
TypeSmall organic molecule
Emp. Form.C30H28N2O
Mol. Mass.432.5561
SMILESOc1ccc2C[C@@]34CN(Cc5ccccc5)CC[C@@]3(Cc3nc5ccccc5cc3C4)c2c1