Reaction Details
TargetKappa-type opioid receptor
LigandBDBM50018996
Substrate/Competitorn/a
Meas. Tech.ChEMBL_1365291 (CHEMBL3292385)
Ki 17±n/a nM
Citation Nagase, HNakajima, RYamamoto, NHirayama, SIwai, TNemoto, TGouda, HHirono, SFujii, H Design and synthesis of quinolinopropellane derivatives with selectived opioid receptor agonism. Bioorg Med Chem Lett24:2851-4 (2014) 
 
Kappa-type opioid receptor
Name:Kappa-type opioid receptor
Type:G Protein-Coupled Receptor (GPCR)
Mol. Mass.:42648.76
Organism:Homo sapiens (Human)
Description:P41145
Residue:380
BDBM50018996
NameBDBM50018996
Synonyms:CHEMBL3287466
TypeSmall organic molecule
Emp. Form.C20H25NO2
Mol. Mass.311.418
SMILESOc1ccc2C[C@]34CCC(=O)C[C@]3(CCN(CC3CC3)C4)c2c1