Reaction Details
TargetNeuronal acetylcholine receptor subunit alpha-4/beta-2
LigandBDBM50019147
Substrate/Competitorn/a
Meas. Tech.ChEMBL_1362136 (CHEMBL3294908)
Ki 0.490000±n/a nM
Citation Liu, YPaige, MOlson, TTAl-Muhtasib, NXie, THou, SWhite, MPCordova, AGuo, JLKellar, KJXiao, YBrown, ML Synthesis and pharmacological characterization of new neuronal nicotinic acetylcholine receptor ligands derived from Sazetidine-A. Bioorg Med Chem Lett24:2954-6 (2014) 
 
Neuronal acetylcholine receptor subunit alpha-4/beta-2
Name:Neuronal acetylcholine receptor subunit alpha-4/beta-2
Type:n/a
Mol. Mass.:n/a
Description:n/a
Components:This complex has 0 components.
Component 1
Name:Neuronal acetylcholine receptor subunit alpha-4
Synonyms:ACHA4_RAT Cholinergic, Nicotinic Alpha4Beta2 Chrna4 Neuronal acetylcholine receptor (alpha4beta2 nAChR) Neuronal acetylcholine receptor subunit alpha 4 beta 2 | Neuronal acetylcholine receptor subunit alpha-4
Type:Enzyme
Mol. Mass.:70196.44
Organism:Rattus norvegicus (Rat)
Description:P09483
Residue:630
Component 2
Name:Neuronal acetylcholine receptor subunit beta-2
Synonyms:ACHB2_RAT Chrnb2 Neuronal acetylcholine receptor non-alpha-1 chain
Type:Enzyme
Mol. Mass.:56910.32
Organism:Rattus norvegicus (Rat)
Description:P12390
Residue:500
BDBM50019147
NameBDBM50019147
Synonyms:CHEMBL3289074
TypeSmall organic molecule
Emp. Form.C16H22N2O
Mol. Mass.258.3587
SMILESCCCCC#Cc1cncc(OC[C@H]2CCCN2)c1