Reaction Details
TargetNeuronal acetylcholine receptor subunit alpha-4/beta-2
LigandBDBM50019148
Substrate/Competitorn/a
Meas. Tech.ChEMBL_1362136 (CHEMBL3294908)
Ki 1.3±n/a nM
Citation Liu, YPaige, MOlson, TTAl-Muhtasib, NXie, THou, SWhite, MPCordova, AGuo, JLKellar, KJXiao, YBrown, ML Synthesis and pharmacological characterization of new neuronal nicotinic acetylcholine receptor ligands derived from Sazetidine-A. Bioorg Med Chem Lett24:2954-6 (2014) 
 
Neuronal acetylcholine receptor subunit alpha-4/beta-2
Name:Neuronal acetylcholine receptor subunit alpha-4/beta-2
Type:n/a
Mol. Mass.:n/a
Description:n/a
Components:This complex has 0 components.
Component 1
Name:Neuronal acetylcholine receptor subunit alpha-4
Synonyms:ACHA4_RAT Cholinergic, Nicotinic Alpha4Beta2 Chrna4 Neuronal acetylcholine receptor (alpha4beta2 nAChR) Neuronal acetylcholine receptor subunit alpha 4 beta 2 | Neuronal acetylcholine receptor subunit alpha-4
Type:Enzyme
Mol. Mass.:70196.44
Organism:Rattus norvegicus (Rat)
Description:P09483
Residue:630
Component 2
Name:Neuronal acetylcholine receptor subunit beta-2
Synonyms:ACHB2_RAT Chrnb2 Neuronal acetylcholine receptor non-alpha-1 chain
Type:Enzyme
Mol. Mass.:56910.32
Organism:Rattus norvegicus (Rat)
Description:P12390
Residue:500
BDBM50019148
NameBDBM50019148
Synonyms:CHEMBL3289075
TypeSmall organic molecule
Emp. Form.C15H21N5O2
Mol. Mass.303.3595
SMILESOCCCCc1cn(nn1)-c1cncc(OC[C@@H]2CCN2)c1