Reaction Details
TargetNeuronal acetylcholine receptor subunit alpha-7
LigandBDBM50019145
Substrate/Competitorn/a
Meas. Tech.ChEMBL_1362137 (CHEMBL3294909)
Ki 13000±n/a nM
Citation Liu, YPaige, MOlson, TTAl-Muhtasib, NXie, THou, SWhite, MPCordova, AGuo, JLKellar, KJXiao, YBrown, ML Synthesis and pharmacological characterization of new neuronal nicotinic acetylcholine receptor ligands derived from Sazetidine-A. Bioorg Med Chem Lett24:2954-6 (2014) 
 
Neuronal acetylcholine receptor subunit alpha-7
Name:Neuronal acetylcholine receptor subunit alpha-7
Type:Enzyme
Mol. Mass.:56502.44
Organism:Rattus norvegicus (Rat)
Description:Q05941
Residue:502
BDBM50019145
NameBDBM50019145
Synonyms:CHEMBL3289072
TypeSmall organic molecule
Emp. Form.C15H20N2O
Mol. Mass.244.3321
SMILESCCCCC#Cc1cncc(OC[C@H]2CCN2)c1