Reaction Details
TargetMuscarinic acetylcholine receptor M4
LigandBDBM50019336
Substrate/Competitorn/a
Meas. Tech.ChEMBL_1362936 (CHEMBL3291978)
EC50 13±n/a nM
Citation Suwa, AKonishi, YUruno, YTakai, KNakako, TSakai, MEnomoto, TOchi, YMatsuda, HKitamura, AUematsu, YKiyoshi, ASumiyoshi, T Discovery of N-sulfonyl-7-azaindoline derivatives as potent, orally available and selective M(4) muscarinic acetylcholine receptor agonists. Bioorg Med Chem Lett24:2909-12 (2014) 
 
Muscarinic acetylcholine receptor M4
Name:Muscarinic acetylcholine receptor M4
Type:Enzyme Catalytic Domain
Mol. Mass.:53079.31
Organism:Homo sapiens (Human)
Description:Cholinergic, muscarinic M4 CHRM4 HUMAN M3::P08173
Residue:479
BDBM50019336
NameBDBM50019336
Synonyms:CHEMBL3289442
TypeSmall organic molecule
Emp. Form.C22H34N4O4S
Mol. Mass.450.595
SMILESCCOC(=O)N1CCC(C)(CN2CCC3(CN(c4ncccc34)S(C)(=O)=O)CC2)CC1