Reaction Details
TargetNeurotensin receptor type 2
LigandBDBM85050
Substrate/Competitorn/a
Meas. Tech.ChEMBL_1364514 (CHEMBL3295311)
EC50 20±n/a nM
Citation Thomas, JBGiddings, AMWiethe, RWOlepu, SWarner, KRSarret, PGendron, LLongpre, JMZhang, YRunyon, SPGilmour, BP Identification of 1-({[1-(4-fluorophenyl)-5-(2-methoxyphenyl)-1H-pyrazol-3-yl]carbonyl}amino)cyclohexane carboxylic acid as a selective nonpeptide neurotensin receptor type 2 compound. J Med Chem57:5318-32 (2014) 
 
Neurotensin receptor type 2
Name:Neurotensin receptor type 2
Type:PROTEIN
Mol. Mass.:46280.50
Organism:Rattus norvegicus
Description:ChEMBL_1466615
Residue:416
BDBM85050
NameBDBM85050
Synonyms:CAS_184162-64-9 SR142948 | SR142948A
TypeSmall organic molecule
Emp. Form.C39H51N5O6
Mol. Mass.685.8521
SMILES[H]C12CC3([H])CC([H])(C1)C(NC(=O)c1cc(-c4c(OC)cccc4OC)n(n1)-c1ccc(cc1C(C)C)C(=O)N(C)CCCN(C)C)(C(O)=O)C([H])(C2)C3