Reaction Details
TargetNeurotensin receptor type 2
LigandBDBM82417
Substrate/Competitorn/a
Meas. Tech.ChEMBL_1364514 (CHEMBL3295311)
EC50 217±n/a nM
Citation Thomas, JBGiddings, AMWiethe, RWOlepu, SWarner, KRSarret, PGendron, LLongpre, JMZhang, YRunyon, SPGilmour, BP Identification of 1-({[1-(4-fluorophenyl)-5-(2-methoxyphenyl)-1H-pyrazol-3-yl]carbonyl}amino)cyclohexane carboxylic acid as a selective nonpeptide neurotensin receptor type 2 compound. J Med Chem57:5318-32 (2014) 
 
Neurotensin receptor type 2
Name:Neurotensin receptor type 2
Type:PROTEIN
Mol. Mass.:46280.50
Organism:Rattus norvegicus
Description:ChEMBL_1466615
Residue:416
BDBM82417
NameBDBM82417
Synonyms:CHEMBL461604 | SR 48527
TypeSmall organic molecule
Emp. Form.C29H29ClN4O5
Mol. Mass.549.017
SMILESCOc1cccc(OC)c1-c1cc(nn1-c1ccnc2cc(Cl)ccc12)C(=O)N[C@@H](C1CCCCC1)C(O)=O