Reaction Details
TargetNeurotensin receptor type 2
LigandBDBM50019423
Substrate/Competitorn/a
Meas. Tech.ChEMBL_1364517 (CHEMBL3295314)
Ki 140±n/a nM
Citation Thomas, JBGiddings, AMWiethe, RWOlepu, SWarner, KRSarret, PGendron, LLongpre, JMZhang, YRunyon, SPGilmour, BP Identification of 1-({[1-(4-fluorophenyl)-5-(2-methoxyphenyl)-1H-pyrazol-3-yl]carbonyl}amino)cyclohexane carboxylic acid as a selective nonpeptide neurotensin receptor type 2 compound. J Med Chem57:5318-32 (2014) 
 
Neurotensin receptor type 2
Name:Neurotensin receptor type 2
Type:PROTEIN
Mol. Mass.:46280.50
Organism:Rattus norvegicus
Description:ChEMBL_1466615
Residue:416
BDBM50019423
NameBDBM50019423
Synonyms:CHEMBL3290105
TypeSmall organic molecule
Emp. Form.C25H26FN3O5
Mol. Mass.467.4894
SMILESCOc1cccc(OC)c1-c1cc(nn1-c1ccc(F)cc1)C(=O)NC1(CCCCC1)C(O)=O