Reaction Details
TargetCarbonic anhydrase 2
LigandBDBM50019580
Substrate/Competitorn/a
Meas. Tech.ChEMBL_1366560 (CHEMBL3296583)
Ki 54±n/a nM
Citation Slawinski, JPogorzelska, AZolnowska, BBrozewicz, KVullo, DSupuran, CT Carbonic anhydrase inhibitors. Synthesis of a novel series of 5-substituted 2,4-dichlorobenzenesulfonamides and their inhibition of human cytosolic isozymes I and II and the transmembrane tumor-associated isozymes IX and XII. Eur J Med Chem82:47-55 (2014) 
 
Carbonic anhydrase 2
Name:Carbonic anhydrase 2
Type:Enzyme
Mol. Mass.:29250.71
Organism:Homo sapiens (Human)
Description:P00918
Residue:260
BDBM50019580
NameBDBM50019580
Synonyms:CHEMBL3291089
TypeSmall organic molecule
Emp. Form.C14H9Cl3N4O2S
Mol. Mass.403.671
SMILESNS(=O)(=O)c1cc(-c2nnc([nH]2)-c2ccc(Cl)cc2)c(Cl)cc1Cl