Reaction Details
TargetCarbonic anhydrase 9
LigandBDBM50013792
Substrate/Competitorn/a
Meas. Tech.ChEMBL_1366561 (CHEMBL3296584)
Ki 27±n/a nM
Citation Slawinski, JPogorzelska, AZolnowska, BBrozewicz, KVullo, DSupuran, CT Carbonic anhydrase inhibitors. Synthesis of a novel series of 5-substituted 2,4-dichlorobenzenesulfonamides and their inhibition of human cytosolic isozymes I and II and the transmembrane tumor-associated isozymes IX and XII. Eur J Med Chem82:47-55 (2014) 
 
Carbonic anhydrase 9
Name:Carbonic anhydrase 9
Type:Enzyme
Mol. Mass.:49669.03
Organism:Homo sapiens (Human)
Description:Catalytic domain of human cloned isozyme was used in the assay
Residue:459
BDBM50013792
NameBDBM50013792
Synonyms:CHEBI:6822 Neptazane
TypeSmall organic molecule
Emp. Form.C5H8N4O3S2
Mol. Mass.236.272
SMILESCC(=O)\N=c1\sc(nn1C)S(N)(=O)=O