Reaction Details
TargetCarbonic anhydrase 9
LigandBDBM50019536
Substrate/Competitorn/a
Meas. Tech.ChEMBL_1366561 (CHEMBL3296584)
Ki 76±n/a nM
Citation Slawinski, JPogorzelska, AZolnowska, BBrozewicz, KVullo, DSupuran, CT Carbonic anhydrase inhibitors. Synthesis of a novel series of 5-substituted 2,4-dichlorobenzenesulfonamides and their inhibition of human cytosolic isozymes I and II and the transmembrane tumor-associated isozymes IX and XII. Eur J Med Chem82:47-55 (2014) 
 
Carbonic anhydrase 9
Name:Carbonic anhydrase 9
Type:Enzyme
Mol. Mass.:49669.03
Organism:Homo sapiens (Human)
Description:Catalytic domain of human cloned isozyme was used in the assay
Residue:459
BDBM50019536
NameBDBM50019536
Synonyms:CHEMBL3291104
TypeSmall organic molecule
Emp. Form.C19H20Cl2N4O5S
Mol. Mass.487.357
SMILESNS(=O)(=O)c1cc(NC(=O)N2CCN(Cc3ccc4OCOc4c3)CC2)c(Cl)cc1Cl