Reaction Details
TargetRetinal rod rhodopsin-sensitive cGMP 3',5'-cyclic phosphodiesterase subunit delta
LigandBDBM50019824
Substrate/Competitorn/a
Meas. Tech.ChEMBL_1361547 (CHEMBL3294871)
Kd 18.0±n/a nM
Citation Zimmermann, GSchultz-Fademrecht, CKüchler, PMurarka, SIsmail, STriola, GNussbaumer, PWittinghofer, AWaldmann, H Structure guided design and kinetic analysis of highly potent benzimidazole inhibitors targeting the PDEd prenyl binding site. J Med Chem57:5435-48 (2014) 
 
Retinal rod rhodopsin-sensitive cGMP 3',5'-cyclic phosphodiesterase subunit delta
Name:Retinal rod rhodopsin-sensitive cGMP 3',5'-cyclic phosphodiesterase subunit delta
Type:PROTEIN
Mol. Mass.:17418.30
Organism:Homo sapiens (Human)
Description:ChEMBL_105761
Residue:150
BDBM50019824
NameBDBM50019824
Synonyms:CHEMBL3286904
TypeSmall organic molecule
Emp. Form.C40H42N6O2
Mol. Mass.638.8005
SMILESO=C(OCC(C1CCCNC1)n1c(nc2ccccc12)-c1ccccc1)C1CCN(CC1)c1nc2ccccc2n1Cc1ccccc1