Reaction Details
TargetRetinal rod rhodopsin-sensitive cGMP 3',5'-cyclic phosphodiesterase subunit delta
LigandBDBM50019861
Substrate/Competitorn/a
Meas. Tech.ChEMBL_1361547 (CHEMBL3294871)
Kd 26±n/a nM
Citation Zimmermann, GSchultz-Fademrecht, CKüchler, PMurarka, SIsmail, STriola, GNussbaumer, PWittinghofer, AWaldmann, H Structure guided design and kinetic analysis of highly potent benzimidazole inhibitors targeting the PDEd prenyl binding site. J Med Chem57:5435-48 (2014) 
 
Retinal rod rhodopsin-sensitive cGMP 3',5'-cyclic phosphodiesterase subunit delta
Name:Retinal rod rhodopsin-sensitive cGMP 3',5'-cyclic phosphodiesterase subunit delta
Type:PROTEIN
Mol. Mass.:17418.30
Organism:Homo sapiens (Human)
Description:ChEMBL_105761
Residue:150
BDBM50019861
NameBDBM50019861
Synonyms:CHEMBL3286925
TypeSmall organic molecule
Emp. Form.C53H71FN6O9S
Mol. Mass.987.229
SMILES[H][C@]12CS[C@@H](CCCCC(=O)NCCCOCCOCCOCCCNC(=O)C[C@H](O)C[C@H](O)CCn3c(C(C)C)c(C(=O)Nc4ccccc4)c(c3-c3ccc(F)cc3)-c3ccccc3)[C@@]1([H])NC(=O)N2