Reaction Details
TargetRetinal rod rhodopsin-sensitive cGMP 3',5'-cyclic phosphodiesterase subunit delta
LigandBDBM106769
Substrate/Competitorn/a
Meas. Tech.ChEMBL_1361836 (CHEMBL3292772)
Kd 2400±n/a nM
Citation Zimmermann, GSchultz-Fademrecht, CKüchler, PMurarka, SIsmail, STriola, GNussbaumer, PWittinghofer, AWaldmann, H Structure guided design and kinetic analysis of highly potent benzimidazole inhibitors targeting the PDEd prenyl binding site. J Med Chem57:5435-48 (2014) 
 
Retinal rod rhodopsin-sensitive cGMP 3',5'-cyclic phosphodiesterase subunit delta
Name:Retinal rod rhodopsin-sensitive cGMP 3',5'-cyclic phosphodiesterase subunit delta
Type:PROTEIN
Mol. Mass.:17418.30
Organism:Homo sapiens (Human)
Description:ChEMBL_105761
Residue:150
BDBM106769
NameBDBM106769
Synonyms:1‐benzyl‐2‐phenyl‐1,3‐benzodiazole (B10)
TypeSmall organic molecule
Emp. Form.C20H16N2
Mol. Mass.284.3544
SMILESC(c1ccccc1)n1c(nc2ccccc12)-c1ccccc1