Reaction Details
TargetTyrosine-protein kinase ITK/TSK
LigandBDBM50019898
Substrate/Competitorn/a
Meas. Tech.ChEMBL_1361886 (CHEMBL3293061)
Ki<0.100000±n/a nM
Citation Abdel-Magid, AF Treatment of Immunological or Inflammatory Disorders with ITK Kinase Inhibitors. ACS Med Chem Lett5:456-7 (2014) 
 
Tyrosine-protein kinase ITK/TSK
Name:Tyrosine-protein kinase ITK/TSK
Type:Protein
Mol. Mass.:71839.20
Organism:Homo sapiens (Human)
Description:Q08881
Residue:620
BDBM50019898
NameBDBM50019898
Synonyms:CHEMBL3287197
TypeSmall organic molecule
Emp. Form.C21H24N6O3S
Mol. Mass.440.519
SMILESCC12CC1Cc1c(C2)[nH]nc1C(=O)Nc1cnn(c1)C(CS(C)(=O)=O)c1cccnc1