Reaction Details
TargetIntermediate conductance calcium-activated potassium channel protein 4
LigandBDBM50019900
Substrate/Competitorn/a
Meas. Tech.ChEMBL_1361891 (CHEMBL3293066)
IC50 49±n/a nM
Citation Blass, B Fused Thiazin-3-ones as KCa3.1 Inhibitors. ACS Med Chem Lett5:460-1 (2014) 
 
Intermediate conductance calcium-activated potassium channel protein 4
Name:Intermediate conductance calcium-activated potassium channel protein 4
Type:PROTEIN
Mol. Mass.:47723.22
Organism:Homo sapiens (Human)
Description:ChEMBL_1361891
Residue:427
BDBM50019900
NameBDBM50019900
Synonyms:CHEMBL3287205 | US9533999, i-5
TypeSmall organic molecule
Emp. Form.C15H10F4N2O4S
Mol. Mass.390.31
SMILESFc1ccc(CN2C(=O)CS(=O)(=O)c3cccnc23)cc1OC(F)(F)F