Reaction Details
TargetVascular endothelial growth factor receptor 2
LigandBDBM50020228
Substrate/Competitorn/a
Meas. Tech.ChEMBL_1364555 (CHEMBL3295610)
IC50 7.6±n/a nM
Citation Lv, YLi, MLiu, TTong, LPeng, TWei, LDing, JXie, HDuan, W Discovery of a New Series of Naphthamides as Potent VEGFR-2 Kinase Inhibitors. ACS Med Chem Lett5:592-7 (2014) 
 
Vascular endothelial growth factor receptor 2
Name:Vascular endothelial growth factor receptor 2
Type:Receptor Tyrosine Kinase
Mol. Mass.:151510.97
Organism:Homo sapiens (Human)
Description:P35968
Residue:1356
BDBM50020228
NameBDBM50020228
Synonyms:CHEMBL3288509 | US9914707, I-22
TypeSmall organic molecule
Emp. Form.C25H19FN4O
Mol. Mass.410.443
SMILESCc1ccc(NC(=O)c2cccc3cc(ccc23)-c2cccc3[nH]nc(N)c23)c(F)c1