Reaction Details
TargetVascular endothelial growth factor receptor 2
LigandBDBM50020248
Substrate/Competitorn/a
Meas. Tech.ChEMBL_1364556 (CHEMBL3295611)
IC50 86±n/a nM
Citation Lv, YLi, MLiu, TTong, LPeng, TWei, LDing, JXie, HDuan, W Discovery of a New Series of Naphthamides as Potent VEGFR-2 Kinase Inhibitors. ACS Med Chem Lett5:592-7 (2014) 
 
Vascular endothelial growth factor receptor 2
Name:Vascular endothelial growth factor receptor 2
Type:Receptor Tyrosine Kinase
Mol. Mass.:151510.97
Organism:Homo sapiens (Human)
Description:P35968
Residue:1356
BDBM50020248
NameBDBM50020248
Synonyms:CHEMBL3288503 | US9914707, I-6
TypeSmall organic molecule
Emp. Form.C25H20N4O
Mol. Mass.392.4525
SMILESCc1ccccc1NC(=O)c1cccc2cc(ccc12)-c1cccc2[nH]nc(N)c12