Reaction Details
TargetPlatelet-derived growth factor receptor alpha
LigandBDBM50020165
Substrate/Competitorn/a
Meas. Tech.ChEMBL_1364559 (CHEMBL3295614)
IC50 549±n/a nM
Citation Lv, YLi, MLiu, TTong, LPeng, TWei, LDing, JXie, HDuan, W Discovery of a New Series of Naphthamides as Potent VEGFR-2 Kinase Inhibitors. ACS Med Chem Lett5:592-7 (2014) 
 
Platelet-derived growth factor receptor alpha
Name:Platelet-derived growth factor receptor alpha
Type:Protein
Mol. Mass.:122633.38
Organism:Homo sapiens (Human)
Description:P16234
Residue:1089
BDBM50020165
NameBDBM50020165
Synonyms:CHEMBL3288526 | US9914707, I-4
TypeSmall organic molecule
Emp. Form.C23H16N4OS
Mol. Mass.396.464
SMILESNc1ncnc2scc(-c3ccc4c(cccc4c3)C(=O)Nc3ccccc3)c12