Reaction Details
TargetReceptor tyrosine-protein kinase erbB-2
LigandBDBM50020165
Substrate/Competitorn/a
Meas. Tech.ChEMBL_1364564 (CHEMBL3295619)
IC50>10000±n/a nM
Citation Lv, YLi, MLiu, TTong, LPeng, TWei, LDing, JXie, HDuan, W Discovery of a New Series of Naphthamides as Potent VEGFR-2 Kinase Inhibitors. ACS Med Chem Lett5:592-7 (2014) 
 
Receptor tyrosine-protein kinase erbB-2
Name:Receptor tyrosine-protein kinase erbB-2
Type:n/a
Mol. Mass.:137894.47
Organism:Homo sapiens (Human)
Description:P04626
Residue:1255
BDBM50020165
NameBDBM50020165
Synonyms:CHEMBL3288526 | US9914707, I-4
TypeSmall organic molecule
Emp. Form.C23H16N4OS
Mol. Mass.396.464
SMILESNc1ncnc2scc(-c3ccc4c(cccc4c3)C(=O)Nc3ccccc3)c12