Reaction Details
TargetEphrin type-A receptor 2
LigandBDBM50020165
Substrate/Competitorn/a
Meas. Tech.ChEMBL_1364569 (CHEMBL3295624)
IC50>10000±n/a nM
Citation Lv, YLi, MLiu, TTong, LPeng, TWei, LDing, JXie, HDuan, W Discovery of a New Series of Naphthamides as Potent VEGFR-2 Kinase Inhibitors. ACS Med Chem Lett5:592-7 (2014) 
 
Ephrin type-A receptor 2
Name:Ephrin type-A receptor 2
Type:PROTEIN
Mol. Mass.:108260.70
Organism:Homo sapiens (Human)
Description:ChEMBL_1505248
Residue:976
BDBM50020165
NameBDBM50020165
Synonyms:CHEMBL3288526 | US9914707, I-4
TypeSmall organic molecule
Emp. Form.C23H16N4OS
Mol. Mass.396.464
SMILESNc1ncnc2scc(-c3ccc4c(cccc4c3)C(=O)Nc3ccccc3)c12