Reaction Details
TargetAlpha-2A adrenergic receptor
LigandBDBM50019492
Substrate/Competitorn/a
Meas. Tech.ChEMBL_1366586 (CHEMBL3296644)
Ki 1.9±n/a nM
Citation O'Donovan, DHMuguruza, CCallado, LFRozas, I Guanidine-baseda2-adrenoceptor ligands: Towards selective antagonist activity. Eur J Med Chem82:242-54 (2014) 
 
Alpha-2A adrenergic receptor
Name:Alpha-2A adrenergic receptor
Type:Enzyme
Mol. Mass.:48979.91
Organism:Homo sapiens (Human)
Description:P08913
Residue:465
BDBM50019492
NameBDBM50019492
Synonyms:(+)2-(2-Methoxy-2,3-dihydro-benzo[1,4]dioxin-2-yl)-4,5-dihydro-1H-imidazole 2-(2,3-dihydro-2-methoxy-1,4-benzodioxin-2-yl)-4,5-dihydro-1H-imidazole 2-(2-methoxy-2,3-dihydrobenzo[b][1,4]dioxin-2-yl)-4,5-dihydro-1H-imidazole CHEMBL10332 RX821002
TypeSmall organic molecule
Emp. Form.C12H14N2O3
Mol. Mass.234.2512
SMILESCOC1(COc2ccccc2O1)C1=NCCN1