Reaction Details
TargetAccessory gene regulator protein A
LigandBDBM115127
Substrate/Competitorn/a
Meas. Tech.ChEMBL_1366621 (CHEMBL3296715)
IC50 30600±n/a nM
Citation Figueroa, MJarmusch, AKRaja, HAEl-Elimat, TKavanaugh, JSHorswill, ARCooks, RGCech, NBOberlies, NH Polyhydroxyanthraquinones as quorum sensing inhibitors from the guttates of Penicillium restrictum and their analysis by desorption electrospray ionization mass spectrometry. J Nat Prod77:1351-8 (2014) 
 
Accessory gene regulator protein A
Name:Accessory gene regulator protein A
Type:PROTEIN
Mol. Mass.:27903.57
Organism:Staphylococcus aureus
Description:ChEMBL_1366621
Residue:238
BDBM115127
NameBDBM115127
Synonyms:4,5,7-trihydroxy-9,10-diketo-anthracene-2-carboxylic acid 4,5,7-trihydroxy-9,10-dioxoanthracene-2-carboxylic acid MLS000876948 cid_361510
TypeSmall organic molecule
Emp. Form.C15H8O7
Mol. Mass.300.2198
SMILESOC(=O)c1cc(O)c2C(=O)c3c(O)cc(O)cc3C(=O)c2c1