Reaction Details
TargetDelta-type opioid receptor
LigandBDBM50001714
Substrate/Competitorn/a
Meas. Tech.ChEMBL_1363047 (CHEMBL3293116)
Ki 0.230000±n/a nM
Citation Schoultz, BWHjørnevik, TReed, BJMarton, JCoello, CSWilloch, FHenriksen, G Synthesis and evaluation of three structurally related¹8F-labeled orvinols of different intrinsic activities: 6-O-[¹8F]fluoroethyl-diprenorphine ([¹8F]FDPN), 6-O-[¹8F]fluoroethyl-buprenorphine ([¹8F]FBPN), and 6-O-[¹8F]fluoroethyl-phenethyl-orvinol ([¹8F]FPEO). J Med Chem57:5464-9 (2014) 
 
Delta-type opioid receptor
Name:Delta-type opioid receptor
Type:G Protein-Coupled Receptor (GPCR)
Mol. Mass.:40382.98
Organism:Homo sapiens (Human)
Description:Competition binding assays were carried out using membrane preparations from transfected HN9.10 cells that constitutively expressed the delta opioid receptor.
Residue:372
BDBM50001714
NameBDBM50001714
Synonyms:2-[3-cyclopropylmethyl-11-hydroxy-15-methoxy-(1S,2R,6S,14R,15R,16R)-13-oxa-3-azahexacyclo[13.2.2.12,8.01,6.06,14.07,12]icosa-7,9,11-trien-16-yl]-2-propanol 2-[3-cyclopropylmethyl-11-hydroxy-15-methoxy-13-oxa-3-azahexacyclo[13.2.2.12,8.01,6.06,14.07,12]icosa-7(12),8,10-trien-16-yl]-2-propanol DIPRENORPHINE-HCl | Diprenorphine
TypeSmall organic molecule
Emp. Form.C26H35NO4
Mol. Mass.425.5604
SMILESCO[C@]12CC[C@@]3(C[C@@H]1C(C)(C)O)[C@H]1Cc4ccc(O)c5O[C@@H]2[C@]3(CCN1CC1CC1)c45