Reaction Details
TargetDelta-type opioid receptor
LigandBDBM50020711
Substrate/Competitorn/a
Meas. Tech.ChEMBL_1363047 (CHEMBL3293116)
Ki 0.490000±n/a nM
Citation Schoultz, BWHjørnevik, TReed, BJMarton, JCoello, CSWilloch, FHenriksen, G Synthesis and evaluation of three structurally related¹8F-labeled orvinols of different intrinsic activities: 6-O-[¹8F]fluoroethyl-diprenorphine ([¹8F]FDPN), 6-O-[¹8F]fluoroethyl-buprenorphine ([¹8F]FBPN), and 6-O-[¹8F]fluoroethyl-phenethyl-orvinol ([¹8F]FPEO). J Med Chem57:5464-9 (2014) 
 
Delta-type opioid receptor
Name:Delta-type opioid receptor
Type:G Protein-Coupled Receptor (GPCR)
Mol. Mass.:40382.98
Organism:Homo sapiens (Human)
Description:Competition binding assays were carried out using membrane preparations from transfected HN9.10 cells that constitutively expressed the delta opioid receptor.
Residue:372
BDBM50020711
NameBDBM50020711
Synonyms:CHEMBL3291216
TypeSmall organic molecule
Emp. Form.C31H36FNO4
Mol. Mass.505.6202
SMILES[H][C@@]12Oc3c4c(C[C@@]5([H])N(C)CC[C@@]14[C@]51C[C@]([H])([C@@](C)(O)CCc4ccccc4)[C@@]2(OCCF)C=C1)ccc3O