Reaction Details
TargetTyrosinase
LigandBDBM50020713
Substrate/Competitorn/a
Meas. Tech.ChEMBL_1363427 (CHEMBL3295816)
Ki 2800000±n/a nM
Citation Cheung, FWLeung, AWLiu, WKChe, CT Tyrosinase inhibitory activity of a glucosylated hydroxystilbene in mouse melan-a melanocytes. J Nat Prod77:1270-4 (2014) 
 
Tyrosinase
Name:Tyrosinase
Type:Protein
Mol. Mass.:60600.74
Organism:Mus musculus (Mouse)
Description:n/a
Residue:533
BDBM50020713
NameBDBM50020713
Synonyms:CHEMBL460860
TypeSmall organic molecule
Emp. Form.C20H22O9
Mol. Mass.406.3833
SMILESOC[C@H]1O[C@@H](Oc2c(O)cc(O)cc2\C=C\c2ccc(O)cc2)[C@H](O)[C@@H](O)[C@@H]1O