Reaction Details
TargetTyrosinase
LigandBDBM50031467
Substrate/Competitorn/a
Meas. Tech.ChEMBL_1363427 (CHEMBL3295816)
Ki 5500000±n/a nM
Citation Cheung, FWLeung, AWLiu, WKChe, CT Tyrosinase inhibitory activity of a glucosylated hydroxystilbene in mouse melan-a melanocytes. J Nat Prod77:1270-4 (2014) 
 
Tyrosinase
Name:Tyrosinase
Type:Protein
Mol. Mass.:60600.74
Organism:Mus musculus (Mouse)
Description:n/a
Residue:533
BDBM50031467
NameBDBM50031467
Synonyms:5-HYDROXY-2-(HYDROXYMETHYL)-4H-PYRAN-4-ONE CHEMBL287556 US10857082, Kojic acid US9682910, kojic acid
TypeSmall organic molecule
Emp. Form.C6H6O4
Mol. Mass.142.1094
SMILESOCc1cc(=O)c(O)co1