Reaction Details
TargetHistone deacetylase 1
LigandBDBM50020872
Substrate/Competitorn/a
Meas. Tech.ChEMBL_1364645 (CHEMBL3291778)
IC50 120±n/a nM
Citation Chen, FChai, HSu, MBZhang, YMLi, JXie, XNan, FJ Potent and orally efficacious bisthiazole-based histone deacetylase inhibitors. ACS Med Chem Lett5:628-33 (2014) 
 
Histone deacetylase 1
Name:Histone deacetylase 1
Type:Enzyme
Mol. Mass.:55090.27
Organism:Homo sapiens (Human)
Description:Q13547
Residue:482
BDBM50020872
NameBDBM50020872
Synonyms:CHEMBL3287010 | US9216962, CFH426-S
TypeSmall organic molecule
Emp. Form.C18H23N3O3S3
Mol. Mass.425.589
SMILESCC(C)[C@H](NC(=O)c1csc(n1)-c1csc(C)n1)C(=O)OC\C=C\CCS