Reaction Details
TargetHistone deacetylase 1
LigandBDBM50020890
Substrate/Competitorn/a
Meas. Tech.ChEMBL_1364645 (CHEMBL3291778)
IC50 50±n/a nM
Citation Chen, FChai, HSu, MBZhang, YMLi, JXie, XNan, FJ Potent and orally efficacious bisthiazole-based histone deacetylase inhibitors. ACS Med Chem Lett5:628-33 (2014) 
 
Histone deacetylase 1
Name:Histone deacetylase 1
Type:Enzyme
Mol. Mass.:55090.27
Organism:Homo sapiens (Human)
Description:Q13547
Residue:482
BDBM50020890
NameBDBM50020890
Synonyms:CHEMBL3287250 | US9216962, CFH382
TypeSmall organic molecule
Emp. Form.C16H22N4O3S2
Mol. Mass.382.501
SMILESCC(C)Cc1sc(nc1C(=O)NCCCCC(=O)NO)-c1nccs1