Reaction Details
TargetHistone deacetylase 3
LigandBDBM50020872
Substrate/Competitorn/a
Meas. Tech.ChEMBL_1364647 (CHEMBL3291780)
IC50 110±n/a nM
Citation Chen, FChai, HSu, MBZhang, YMLi, JXie, XNan, FJ Potent and orally efficacious bisthiazole-based histone deacetylase inhibitors. ACS Med Chem Lett5:628-33 (2014) 
 
Histone deacetylase 3
Name:Histone deacetylase 3
Type:Enzyme
Mol. Mass.:48829.55
Organism:Homo sapiens (Human)
Description:O15379
Residue:428
BDBM50020872
NameBDBM50020872
Synonyms:CHEMBL3287010 | US9216962, CFH426-S
TypeSmall organic molecule
Emp. Form.C18H23N3O3S3
Mol. Mass.425.589
SMILESCC(C)[C@H](NC(=O)c1csc(n1)-c1csc(C)n1)C(=O)OC\C=C\CCS