Reaction Details
TargetVascular endothelial growth factor receptor 2
LigandBDBM50021574
Substrate/Competitorn/a
Meas. Tech.ChEMBL_1364715 (CHEMBL3293757)
IC50 7.0±n/a nM
Citation Zhou, SLiao, HHe, CDou, YJiang, MRen, LZhao, YGong, P Design, synthesis and structure-activity relationships of novel 4-phenoxyquinoline derivatives containing pyridazinone moiety as potential antitumor agents. Eur J Med Chem83:581-93 (2014) 
 
Vascular endothelial growth factor receptor 2
Name:Vascular endothelial growth factor receptor 2
Type:Receptor Tyrosine Kinase
Mol. Mass.:151510.97
Organism:Homo sapiens (Human)
Description:P35968
Residue:1356
BDBM50021574
NameBDBM50021574
Synonyms:BMS-907351 CHEBI:72317 Cometriq US10202365, Compound Cabozantinib US10273211, Compound Cabozantinib US10774070, Compound Cabozantinib XL-184 | cabozantinib s-malate
TypeSmall organic molecule
Emp. Form.C28H24FN3O5
Mol. Mass.501.5057
SMILESCOc1cc2nccc(Oc3ccc(NC(=O)C4(CC4)C(=O)Nc4ccc(F)cc4)cc3)c2cc1OC