Reaction Details
TargetHepatocyte growth factor receptor
LigandBDBM50021576
Substrate/Competitorn/a
Meas. Tech.ChEMBL_1364700 (CHEMBL3293742)
IC50 5.6±n/a nM
Citation Zhou, SLiao, HHe, CDou, YJiang, MRen, LZhao, YGong, P Design, synthesis and structure-activity relationships of novel 4-phenoxyquinoline derivatives containing pyridazinone moiety as potential antitumor agents. Eur J Med Chem83:581-93 (2014) 
 
Hepatocyte growth factor receptor
Name:Hepatocyte growth factor receptor
Type:Protein
Mol. Mass.:155559.73
Organism:Homo sapiens (Human)
Description:P08581
Residue:1390
BDBM50021576
NameBDBM50021576
Synonyms:CHEMBL3290918
TypeSmall organic molecule
Emp. Form.C37H35F4N5O5
Mol. Mass.705.6979
SMILESCOc1cc2c(Oc3ccc(NC(=O)c4nn(-c5ccccc5C(F)(F)F)c(=O)cc4C)cc3F)ccnc2cc1OCCCN1CCCCC1